Reaction Details
TargetAcetylcholinesterase
LigandBDBM50003996
Substrate/Competitorn/a
Meas. Tech.ChEBML_28911
IC50 5.4±n/a nM
Citation Sugimoto, HTsuchiya, YSugumi, HHigurashi, KKaribe, NIimura, YSasaki, AAraki, SYamanishi, YYamatsu, K Synthesis and structure-activity relationships of acetylcholinesterase inhibitors: 1-benzyl-4-(2-phthalimidoethyl)piperidine and related derivatives. J Med Chem35:4542-8 (1993) Acetylcholinesterase
Name:Acetylcholinesterase
Type:Enzyme
Mol. Mass.:68165.65
Organism:Mus musculus (mouse)
Description:n/a
Residue:614
BDBM50003996
NameBDBM50003996
Synonyms:CHEMBL126354 N-[2-(1-Benzyl-piperidin-4-yl)-ethyl]-4-nitro-N-phenyl-benzamide
TypeSmall organic molecule
Emp. Form.C27H29N3O3
Mol. Mass.443.5375
SMILES[O-][N+](=O)c1ccc(cc1)C(=O)N(CCC1CCN(Cc2ccccc2)CC1)c1ccccc1