Reaction Details
TargetAcetylcholinesterase
LigandBDBM50003999
Substrate/Competitorn/a
Meas. Tech.ChEBML_28911
IC50 4.5±n/a nM
Citation Sugimoto, HTsuchiya, YSugumi, HHigurashi, KKaribe, NIimura, YSasaki, AAraki, SYamanishi, YYamatsu, K Synthesis and structure-activity relationships of acetylcholinesterase inhibitors: 1-benzyl-4-(2-phthalimidoethyl)piperidine and related derivatives. J Med Chem35:4542-8 (1993) Acetylcholinesterase
Name:Acetylcholinesterase
Type:Enzyme
Mol. Mass.:68165.65
Organism:Mus musculus (mouse)
Description:n/a
Residue:614
BDBM50003999
NameBDBM50003999
Synonyms:3-(2-(1-benzylpiperidin-4-yl)ethyl)-7-chloroquinazoline-2,4(1H,3H)-dione CHEMBL138552
TypeSmall organic molecule
Emp. Form.C22H24ClN3O2
Mol. Mass.397.898
SMILESClc1ccc2c(c1)[nH]c(=O)n(CCC1CCN(Cc3ccccc3)CC1)c2=O