Reaction Details
TargetDCN1-like protein 1
LigandBDBM50245154
Substrate/Competitorn/a
Meas. Tech.ChEMBL_1674520 (CHEMBL4024549)
IC50 18±n/a nM
Citation Hammill, JTBhasin, DScott, DCMin, JChen, YLu, YYang, LKim, HSConnelly, MCHammill, CHolbrook, GJeffries, CSingh, BSchulman, BAGuy, RK Discovery of an Orally Bioavailable Inhibitor of Defective in Cullin Neddylation 1 (DCN1)-Mediated Cullin Neddylation. J Med Chem61:2694-2706 (2018) 
 
DCN1-like protein 1
Name:DCN1-like protein 1
Type:PROTEIN
Mol. Mass.:30118.96
Organism:Homo sapiens
Description:ChEMBL_117443
Residue:259
BDBM50245154
NameBDBM50245154
Synonyms:CHEMBL4067795 | US11116757, No. A10
TypeSmall organic molecule
Emp. Form.C28H35N3O
Mol. Mass.429.597
SMILESCCCC(C)N1CCC(CC1)N(Cc1ccccc1)C(=O)Nc1ccc2ccccc2c1