Reaction Details
TargetEstrogen receptor
LigandBDBM50180684
Substrate/Competitorn/a
Meas. Tech.ChEMBL_1674627 (CHEMBL4024656)
IC50 10±n/a nM
Citation Tria, GSAbrams, TBaird, JBurks, HEFirestone, BGaither, LAHamann, LGHe, GKirby, CAKim, SLombardo, FMacchi, KJMcDonnell, DPMishina, YNorris, JDNunez, JSpringer, CSun, YThomsen, NMWang, CWang, JYu, BTiong-Yip, CLPeukert, S Discovery of LSZ102, a Potent, Orally Bioavailable Selective Estrogen Receptor Degrader (SERD) for the Treatment of Estrogen Receptor Positive Breast Cancer. J Med Chem61:2837-2864 (2018) 
 
Estrogen receptor
Name:Estrogen receptor
Type:Protein
Mol. Mass.:66230.44
Organism:Homo sapiens (Human)
Description:P03372
Residue:595
BDBM50180684
NameBDBM50180684
Synonyms:4-OHT TamoGel
TypeSmall organic molecule
Emp. Form.C26H29NO2
Mol. Mass.387.514
SMILESCC\C(=C(/c1ccccc1)c1ccc(OCCN(C)C)cc1)c1ccc(O)cc1