Reaction Details
TargetEstrogen receptor
LigandBDBM50090462
Substrate/Competitorn/a
Meas. Tech.ChEMBL_1674617 (CHEMBL4024646)
IC50 0.500000±n/a nM
Citation Tria, GSAbrams, TBaird, JBurks, HEFirestone, BGaither, LAHamann, LGHe, GKirby, CAKim, SLombardo, FMacchi, KJMcDonnell, DPMishina, YNorris, JDNunez, JSpringer, CSun, YThomsen, NMWang, CWang, JYu, BTiong-Yip, CLPeukert, S Discovery of LSZ102, a Potent, Orally Bioavailable Selective Estrogen Receptor Degrader (SERD) for the Treatment of Estrogen Receptor Positive Breast Cancer. J Med Chem61:2837-2864 (2018) 
 
Estrogen receptor
Name:Estrogen receptor
Type:Protein
Mol. Mass.:66230.44
Organism:Homo sapiens (Human)
Description:P03372
Residue:595
BDBM50090462
NameBDBM50090462
Synonyms:CHEMBL3581693 | US20240043442, Example GDC-0810
TypeSmall organic molecule
Emp. Form.C26H20ClFN2O2
Mol. Mass.446.901
SMILESCC\C(=C(\c1ccc(\C=C\C(O)=O)cc1)c1ccc2[nH]ncc2c1)c1ccc(F)cc1Cl