Reaction Details
TargetEstrogen receptor
LigandBDBM20607
Substrate/Competitorn/a
Meas. Tech.ChEMBL_1674615 (CHEMBL4024644)
IC50 1605±n/a nM
Citation Tria, GSAbrams, TBaird, JBurks, HEFirestone, BGaither, LAHamann, LGHe, GKirby, CAKim, SLombardo, FMacchi, KJMcDonnell, DPMishina, YNorris, JDNunez, JSpringer, CSun, YThomsen, NMWang, CWang, JYu, BTiong-Yip, CLPeukert, S Discovery of LSZ102, a Potent, Orally Bioavailable Selective Estrogen Receptor Degrader (SERD) for the Treatment of Estrogen Receptor Positive Breast Cancer. J Med Chem61:2837-2864 (2018) 
 
Estrogen receptor
Name:Estrogen receptor
Type:Protein
Mol. Mass.:66230.44
Organism:Homo sapiens (Human)
Description:P03372
Residue:595
BDBM20607
NameBDBM20607
Synonyms:(2-{4-[(1Z)-1,2-diphenylbut-1-en-1-yl]phenoxy}ethyl)dimethylamine CHEMBL83 NCGC00024928 Tamoxifen Tamoxifen, 7 med.21724, Compound Tamoxifen
TypeSmall organic molecule
Emp. Form.C26H29NO
Mol. Mass.371.5146
SMILESCC\C(=C(/c1ccccc1)c1ccc(OCCN(C)C)cc1)c1ccccc1