Reaction Details
TargetAcyl-CoA (8-3)-desaturase
LigandBDBM50246006
Substrate/Competitorn/a
Meas. Tech.ChEMBL_1676417 (CHEMBL4026560)
IC50 170±n/a nM
Citation Fujimoto, JOkamoto, RNoguchi, NHara, RMasada, SKawamoto, TNagase, HTamura, YOImanishi, MTakagahara, SKubo, KTohyama, KIida, KAndou, TMiyahisa, IMatsui, JHayashi, RMaekawa, TMatsunaga, N Discovery of 3,5-Diphenyl-4-methyl-1,3-oxazolidin-2-ones as Novel, Potent, and Orally Available?-5 Desaturase (D5D) Inhibitors. J Med Chem60:8963-8981 (2017) 
 
Acyl-CoA (8-3)-desaturase
Name:Acyl-CoA (8-3)-desaturase
Type:PROTEIN
Mol. Mass.:51985.80
Organism:Homo sapiens (Human)
Description:ChEMBL_1513296
Residue:444
BDBM50246006
NameBDBM50246006
Synonyms:CHEMBL4087912
TypeSmall organic molecule
Emp. Form.C16H11FN2O2
Mol. Mass.282.2691
SMILESFc1ccc(cc1)C1CN(C(=O)O1)c1cccc(c1)C#N