Reaction Details
TargetAcyl-CoA (8-3)-desaturase
LigandBDBM50246047
Substrate/Competitorn/a
Meas. Tech.ChEMBL_1676416 (CHEMBL4026559)
IC50 47±n/a nM
Citation Fujimoto, JOkamoto, RNoguchi, NHara, RMasada, SKawamoto, TNagase, HTamura, YOImanishi, MTakagahara, SKubo, KTohyama, KIida, KAndou, TMiyahisa, IMatsui, JHayashi, RMaekawa, TMatsunaga, N Discovery of 3,5-Diphenyl-4-methyl-1,3-oxazolidin-2-ones as Novel, Potent, and Orally Available?-5 Desaturase (D5D) Inhibitors. J Med Chem60:8963-8981 (2017) 
 
Acyl-CoA (8-3)-desaturase
Name:Acyl-CoA (8-3)-desaturase
Type:PROTEIN
Mol. Mass.:52505.96
Organism:Rattus norvegicus
Description:ChEMBL_852948
Residue:447
BDBM50246047
NameBDBM50246047
Synonyms:CHEMBL4097127
TypeSmall organic molecule
Emp. Form.C20H21FN2O
Mol. Mass.324.3919
SMILESCCn1cc(C(=O)N(C)C(C)c2ccc(F)cc2)c2ccccc12