Reaction Details
TargetAcyl-CoA (8-3)-desaturase
LigandBDBM50246049
Substrate/Competitorn/a
Meas. Tech.ChEMBL_1676416 (CHEMBL4026559)
IC50 4.0±n/a nM
Citation Fujimoto, JOkamoto, RNoguchi, NHara, RMasada, SKawamoto, TNagase, HTamura, YOImanishi, MTakagahara, SKubo, KTohyama, KIida, KAndou, TMiyahisa, IMatsui, JHayashi, RMaekawa, TMatsunaga, N Discovery of 3,5-Diphenyl-4-methyl-1,3-oxazolidin-2-ones as Novel, Potent, and Orally Available?-5 Desaturase (D5D) Inhibitors. J Med Chem60:8963-8981 (2017) 
 
Acyl-CoA (8-3)-desaturase
Name:Acyl-CoA (8-3)-desaturase
Type:PROTEIN
Mol. Mass.:52505.96
Organism:Rattus norvegicus
Description:ChEMBL_852948
Residue:447
BDBM50246049
NameBDBM50246049
Synonyms:CHEMBL4102458
TypeSmall organic molecule
Emp. Form.C17H12F2N2O2
Mol. Mass.314.2862
SMILESC[C@H]1[C@@H](OC(=O)N1c1cc(F)cc(c1)C#N)c1ccc(F)cc1