Reaction Details
TargetAcyl-CoA (8-3)-desaturase
LigandBDBM50246046
Substrate/Competitorn/a
Meas. Tech.ChEMBL_1676416 (CHEMBL4026559)
IC50 79±n/a nM
Citation Fujimoto, JOkamoto, RNoguchi, NHara, RMasada, SKawamoto, TNagase, HTamura, YOImanishi, MTakagahara, SKubo, KTohyama, KIida, KAndou, TMiyahisa, IMatsui, JHayashi, RMaekawa, TMatsunaga, N Discovery of 3,5-Diphenyl-4-methyl-1,3-oxazolidin-2-ones as Novel, Potent, and Orally Available?-5 Desaturase (D5D) Inhibitors. J Med Chem60:8963-8981 (2017) 
 
Acyl-CoA (8-3)-desaturase
Name:Acyl-CoA (8-3)-desaturase
Type:PROTEIN
Mol. Mass.:52505.96
Organism:Rattus norvegicus
Description:ChEMBL_852948
Residue:447
BDBM50246046
NameBDBM50246046
Synonyms:CHEMBL4069465
TypeSmall organic molecule
Emp. Form.C16H12Cl2FNO2
Mol. Mass.340.176
SMILESFc1ccc(cc1)C1CN(Cc2ccc(Cl)cc2Cl)C(=O)O1