Reaction Details
TargetPlatelet-activating factor acetylhydrolase
LigandBDBM50125265
Substrate/Competitorn/a
Meas. Tech.ChEMBL_1677056 (CHEMBL4027199)
IC50 0.600000±n/a nM
Citation Liu, QHuang, FYuan, XWang, KZou, YShen, JXu, Y Structure-Guided Discovery of Novel, Potent, and Orally Bioavailable Inhibitors of Lipoprotein-Associated Phospholipase A2. J Med Chem60:10231-10244 (2017) 
 
Platelet-activating factor acetylhydrolase
Name:Platelet-activating factor acetylhydrolase
Type:PROTEIN
Mol. Mass.:50084.41
Organism:Homo sapiens (Human)
Description:ChEMBL_156212
Residue:441
BDBM50125265
NameBDBM50125265
Synonyms:CHEMBL204021 | N-(2-Diethylamino-ethyl)-2-[2-(4-fluoro-benzylsulfanyl)-4-oxo-4,5,6,7-tetrahydro-cyclopentapyrimidin-1-yl]-N-(4'-trifluoromethyl-biphenyl-4-ylmethyl)-acetamide
TypeSmall organic molecule
Emp. Form.C36H38F4N4O2S
Mol. Mass.666.771
SMILESCCN(CC)CCN(Cc1ccc(cc1)-c1ccc(cc1)C(F)(F)F)C(=O)Cn1c2CCCc2c(=O)nc1SCc1ccc(F)cc1