Reaction Details
TargetHigh affinity cAMP-specific 3',5'-cyclic phosphodiesterase 7A
LigandBDBM50246909
Substrate/Competitorn/a
Meas. Tech.ChEMBL_1677116 (CHEMBL4027259)
IC50 660±n/a nM
Citation Carzaniga, LAmari, GRizzi, ACapaldi, CDe Fanti, RGhidini, EVilletti, GCarnini, CMoretto, NFacchinetti, FCaruso, PMarchini, GBattipaglia, LPatacchini, RCenacchi, VVolta, RAmadei, FPappani, ACapacchi, SBagnacani, VDelcanale, MPuccini, PCatinella, SCivelli, MArmani, E Discovery and Optimization of Thiazolidinyl and Pyrrolidinyl Derivatives as Inhaled PDE4 Inhibitors for Respiratory Diseases. J Med Chem60:10026-10046 (2017) 
 
High affinity cAMP-specific 3',5'-cyclic phosphodiesterase 7A
Name:High affinity cAMP-specific 3',5'-cyclic phosphodiesterase 7A
Type:Enzyme
Mol. Mass.:55514.96
Organism:Homo sapiens (Human)
Description:Q13946
Residue:482
BDBM50246909
NameBDBM50246909
Synonyms:CHEMBL4075951
TypeSmall organic molecule
Emp. Form.C31H31Cl2F2N3O8S2
Mol. Mass.746.626
SMILESCN(C)C(=O)c1cccc(c1)S(=O)(=O)N1CCS[C@H]1C(=O)O[C@@H](Cc1c(Cl)c[n+]([O-])cc1Cl)c1ccc(OC(F)F)c(OCC2CC2)c1