Reaction Details
TargetCyclin-C
LigandBDBM50248623
Substrate/Competitorn/a
Meas. Tech.ChEMBL_1679277 (CHEMBL4029554)
IC50 0.400000±n/a nM
Citation Ono, KBanno, HOkaniwa, MHirayama, TIwamura, NHikichi, YMurai, SHasegawa, MHasegawa, YYonemori, KHata, AAoyama, KCary, DR Design and synthesis of selective CDK8/19 dual inhibitors: Discovery of 4,5-dihydrothieno[3',4':3,4]benzo[1,2-d]isothiazole derivatives. Bioorg Med Chem25:2336-2350 (2017) 
 
Cyclin-C
Name:Cyclin-C
Type:PROTEIN
Mol. Mass.:33244.88
Organism:Homo sapiens (Human)
Description:ChEMBL_107900
Residue:283
BDBM50248623
NameBDBM50248623
Synonyms:CHEMBL4096487
TypeSmall organic molecule
Emp. Form.C20H18N4O
Mol. Mass.330.3831
SMILESOC[C@H](Nc1cncc(c1)-c1ccc2[nH]ncc2c1)c1ccccc1