Reaction Details
TargetCyclin-C/Cyclin-dependent kinase 19
LigandBDBM50248638
Substrate/Competitorn/a
Meas. Tech.ChEMBL_1679275 (CHEMBL4029552)
IC50 1.3±n/a nM
Citation Ono, KBanno, HOkaniwa, MHirayama, TIwamura, NHikichi, YMurai, SHasegawa, MHasegawa, YYonemori, KHata, AAoyama, KCary, DR Design and synthesis of selective CDK8/19 dual inhibitors: Discovery of 4,5-dihydrothieno[3',4':3,4]benzo[1,2-d]isothiazole derivatives. Bioorg Med Chem25:2336-2350 (2017) 
 
Cyclin-C/Cyclin-dependent kinase 19
Name:Cyclin-C/Cyclin-dependent kinase 19
Synonyms:CDK19/Cyclin C
Type:Protein
Mol. Mass.:n/a
Description:n/a
Components:This complex has 2 components.
Component 1
Name:Cyclin-dependent kinase 19
Type:Serine/Threonine protein kinase
Mol. Mass.:56816.68
Organism:Homo sapiens (Human)
Description:Q9BWU1
Residue:502
Component 2
Name:Cyclin-C
Synonyms:CCNC Cyclin C hSRB11
Type:PROTEIN
Mol. Mass.:33244.88
Organism:Homo sapiens (Human)
Description:ChEMBL_107900
Residue:283
BDBM50248638
NameBDBM50248638
Synonyms:CHEMBL4062244
TypeSmall organic molecule
Emp. Form.C16H13N3O2S2
Mol. Mass.343.423
SMILESCc1ccc(Oc2sc(C(N)=O)c3CCc4cnsc4-c23)cn1