Reaction Details
TargetCyclin-C
LigandBDBM50248686
Substrate/Competitorn/a
Meas. Tech.ChEMBL_1679274 (CHEMBL4029551)
IC50 1.4±n/a nM
Citation Ono, KBanno, HOkaniwa, MHirayama, TIwamura, NHikichi, YMurai, SHasegawa, MHasegawa, YYonemori, KHata, AAoyama, KCary, DR Design and synthesis of selective CDK8/19 dual inhibitors: Discovery of 4,5-dihydrothieno[3',4':3,4]benzo[1,2-d]isothiazole derivatives. Bioorg Med Chem25:2336-2350 (2017) 
 
Cyclin-C
Name:Cyclin-C
Type:PROTEIN
Mol. Mass.:33244.88
Organism:Homo sapiens (Human)
Description:ChEMBL_107900
Residue:283
BDBM50248686
NameBDBM50248686
Synonyms:CHEMBL4071040
TypeSmall organic molecule
Emp. Form.C20H20N4O4S2
Mol. Mass.444.527
SMILESCOCCNC(=O)c1ccc(Oc2sc(C(N)=O)c3CCc4cnsc4-c23)c(C)n1