Reaction Details
TargetProstaglandin E synthase
LigandBDBM50227631
Substrate/Competitorn/a
Meas. Tech.ChEMBL_1679581 (CHEMBL4029858)
IC50 1.9±n/a nM
Citation Muthukaman, NTambe, MShaikh, MPisal, DDeshmukh, STondlekar, SSarode, NNarayana, LGajera, JMKattige, VGHonnegowda, SKarande, VKulkarni, ABehera, DJadhav, SBGudi, GSKhairatkar-Joshi, NGharat, LA Tricyclic 4,4-dimethyl-3,4-dihydrochromeno[3,4-d]imidazole derivatives as microsomal prostaglandin E Bioorg Med Chem Lett27:2594-2601 (2017) 
 
Prostaglandin E synthase
Name:Prostaglandin E synthase
Type:Protein
Mol. Mass.:17112.22
Organism:Homo sapiens (Human)
Description:n/a
Residue:152
BDBM50227631
NameBDBM50227631
Synonyms:2-(6-chloro-1H-phenanthro[9,10-d]imidazol-2-yl)isophthalonitrile | CHEMBL412099
TypeSmall organic molecule
Emp. Form.C23H11ClN4
Mol. Mass.378.813
SMILESClc1ccc2c3[nH]c(nc3c3ccccc3c2c1)-c1c(cccc1C#N)C#N