Reaction Details
TargetATP-sensitive inward rectifier potassium channel 1
LigandBDBM50249244
Substrate/Competitorn/a
Meas. Tech.ChEMBL_1679734 (CHEMBL4030011)
IC50 14±n/a nM
Citation Dong, SVanGelder, KShi, ZCYu, YWu, ZFerguson, RGuo, ZZTang, HFrie, JFu, QGu, XPriest, BTThomas-Fowlkes, BWeinglass, AMargulis, MLiu, JPai, LYHampton, CHaimbach, REOwens, KTong, VXu, SHu, MZingaro, GJMorissette, PEhrhart, JRoy, SSullivan, KPasternak, A Improvement of hERG-ROMK index of spirocyclic ROMK inhibitors through scaffold optimization and incorporation of novel pharmacophores. Bioorg Med Chem Lett27:2559-2566 (2017) 
 
ATP-sensitive inward rectifier potassium channel 1
Name:ATP-sensitive inward rectifier potassium channel 1
Type:Enzyme Catalytic Domain
Mol. Mass.:44809.08
Organism:Homo sapiens (Human)
Description:gi_223460826
Residue:391
BDBM50249244
NameBDBM50249244
Synonyms:CHEMBL4103004
TypeSmall organic molecule
Emp. Form.C24H28N4O5
Mol. Mass.452.5029
SMILESCOc1nccc(n1)N1CCC2(CCN(C[C@H](O)c3ccc4C(=O)OCc4c3C)CC2)C1=O