Reaction Details
TargetATP-sensitive inward rectifier potassium channel 1
LigandBDBM50249305
Substrate/Competitorn/a
Meas. Tech.ChEMBL_1679734 (CHEMBL4030011)
IC50 54±n/a nM
Citation Dong, SVanGelder, KShi, ZCYu, YWu, ZFerguson, RGuo, ZZTang, HFrie, JFu, QGu, XPriest, BTThomas-Fowlkes, BWeinglass, AMargulis, MLiu, JPai, LYHampton, CHaimbach, REOwens, KTong, VXu, SHu, MZingaro, GJMorissette, PEhrhart, JRoy, SSullivan, KPasternak, A Improvement of hERG-ROMK index of spirocyclic ROMK inhibitors through scaffold optimization and incorporation of novel pharmacophores. Bioorg Med Chem Lett27:2559-2566 (2017) 
 
ATP-sensitive inward rectifier potassium channel 1
Name:ATP-sensitive inward rectifier potassium channel 1
Type:Enzyme Catalytic Domain
Mol. Mass.:44809.08
Organism:Homo sapiens (Human)
Description:gi_223460826
Residue:391
BDBM50249305
NameBDBM50249305
Synonyms:CHEMBL4071329
TypeSmall organic molecule
Emp. Form.C22H24ClN3O4S
Mol. Mass.461.962
SMILESCc1c2COC(=O)c2ccc1[C@@H](O)CN1CCC2(CCN(C2=O)c2sncc2Cl)CC1