Reaction Details
TargetATP-sensitive inward rectifier potassium channel 1
LigandBDBM50249216
Substrate/Competitorn/a
Meas. Tech.ChEMBL_1679755 (CHEMBL4030032)
IC50 12±n/a nM
Citation Dong, SVanGelder, KShi, ZCYu, YWu, ZFerguson, RGuo, ZZTang, HFrie, JFu, QGu, XPriest, BTThomas-Fowlkes, BWeinglass, AMargulis, MLiu, JPai, LYHampton, CHaimbach, REOwens, KTong, VXu, SHu, MZingaro, GJMorissette, PEhrhart, JRoy, SSullivan, KPasternak, A Improvement of hERG-ROMK index of spirocyclic ROMK inhibitors through scaffold optimization and incorporation of novel pharmacophores. Bioorg Med Chem Lett27:2559-2566 (2017) 
 
ATP-sensitive inward rectifier potassium channel 1
Name:ATP-sensitive inward rectifier potassium channel 1
Type:Enzyme Catalytic Domain
Mol. Mass.:44809.08
Organism:Homo sapiens (Human)
Description:gi_223460826
Residue:391
BDBM50249216
NameBDBM50249216
Synonyms:CHEMBL4075906
TypeSmall organic molecule
Emp. Form.C23H27N3O4S
Mol. Mass.441.543
SMILESCc1cc(sn1)N1CCC2(CCN(C[C@H](O)c3ccc4C(=O)OCc4c3C)CC2)C1=O