Reaction Details
TargetPotassium voltage-gated channel subfamily H member 2
LigandBDBM50249299
Substrate/Competitorn/a
Meas. Tech.ChEMBL_1679735 (CHEMBL4030012)
IC50 9.5±n/a nM
Citation Dong, SVanGelder, KShi, ZCYu, YWu, ZFerguson, RGuo, ZZTang, HFrie, JFu, QGu, XPriest, BTThomas-Fowlkes, BWeinglass, AMargulis, MLiu, JPai, LYHampton, CHaimbach, REOwens, KTong, VXu, SHu, MZingaro, GJMorissette, PEhrhart, JRoy, SSullivan, KPasternak, A Improvement of hERG-ROMK index of spirocyclic ROMK inhibitors through scaffold optimization and incorporation of novel pharmacophores. Bioorg Med Chem Lett27:2559-2566 (2017) 
 
Potassium voltage-gated channel subfamily H member 2
Name:Potassium voltage-gated channel subfamily H member 2
Type:Multi-pass membrane protein
Mol. Mass.:126672.65
Organism:Homo sapiens (Human)
Description:Q12809
Residue:1159
BDBM50249299
NameBDBM50249299
Synonyms:CHEMBL4093627
TypeSmall organic molecule
Emp. Form.C28H29N3O4S
Mol. Mass.503.613
SMILESCc1c2COC(=O)c2ccc1[C@@H](O)CN1CCC2(CCN(C2=O)c2cc(ns2)-c2ccccc2)CC1