Reaction Details
TargetMelanocortin receptor 3
LigandBDBM50250588
Substrate/Competitorn/a
Meas. Tech.ChEBML_1681902
IC50 18±n/a nM
Citation Zhou, YMowlazadeh Haghighi, SZoi, ISawyer, JRHruby, VJCai, M Design of MC1R Selective?-MSH Analogues with Canonical Amino Acids Leads to Potency and Pigmentation. J Med Chem60:9320-9329 (2017) 
 
Melanocortin receptor 3
Name:Melanocortin receptor 3
Type:Enzyme
Mol. Mass.:36044.86
Organism:Homo sapiens (Human)
Description:P41968
Residue:323
BDBM50250588
NameBDBM50250588
Synonyms:CHEMBL4103570
TypeSmall organic molecule
Emp. Form.C72H101N19O15
Mol. Mass.1472.6906
SMILESCC(C)C[C@H](NC(=O)[C@@H](NC(=O)[C@@H](N)Cc1ccc(O)cc1)C(C)C)C(=O)NCC(=O)N1CCC[C@H]1C(=O)N[C@@H](Cc1ccccc1)C(=O)N[C@@H](CCCNC(N)=N)C(=O)N[C@@H](Cc1ccccc1)C(=O)N[C@@H](CC(O)=O)C(=O)N[C@@H](CCCNC(N)=N)C(=O)N[C@@H](Cc1ccccc1)C(=O)NCC(N)=O