Reaction Details
TargetMelanocyte-stimulating hormone receptor
LigandBDBM50250585
Substrate/Competitorn/a
Meas. Tech.ChEMBL_1681898 (CHEMBL4032175)
IC50 1.2±n/a nM
Citation Zhou, YMowlazadeh Haghighi, SZoi, ISawyer, JRHruby, VJCai, M Design of MC1R Selective?-MSH Analogues with Canonical Amino Acids Leads to Potency and Pigmentation. J Med Chem60:9320-9329 (2017) 
 
Melanocyte-stimulating hormone receptor
Name:Melanocyte-stimulating hormone receptor
Type:Enzyme
Mol. Mass.:34717.23
Organism:Homo sapiens (Human)
Description:Q01726
Residue:317
BDBM50250585
NameBDBM50250585
Synonyms:CHEMBL4104092
TypeSmall organic molecule
Emp. Form.C74H100N22O15S
Mol. Mass.1569.789
SMILESCSCC[C@H](NC(=O)[C@@H](NC(=O)[C@@H](N)Cc1ccc(O)cc1)C(C)C)C(=O)NCC(=O)N[C@@H](Cc1cnc[nH]1)C(=O)N[C@@H](Cc1ccccc1)C(=O)N[C@@H](CCCNC(N)=N)C(=O)N[C@@H](Cc1c[nH]c2ccccc12)C(=O)N[C@@H](CC(O)=O)C(=O)N[C@@H](CCCNC(N)=N)C(=O)N[C@@H](Cc1ccccc1)C(=O)NCC(N)=O