Reaction Details
TargetMelanocyte-stimulating hormone receptor
LigandBDBM50250587
Substrate/Competitorn/a
Meas. Tech.ChEMBL_1681898 (CHEMBL4032175)
IC50 82±n/a nM
Citation Zhou, YMowlazadeh Haghighi, SZoi, ISawyer, JRHruby, VJCai, M Design of MC1R Selective?-MSH Analogues with Canonical Amino Acids Leads to Potency and Pigmentation. J Med Chem60:9320-9329 (2017) 
 
Melanocyte-stimulating hormone receptor
Name:Melanocyte-stimulating hormone receptor
Type:Enzyme
Mol. Mass.:34717.23
Organism:Homo sapiens (Human)
Description:Q01726
Residue:317
BDBM50250587
NameBDBM50250587
Synonyms:CHEMBL4079302
TypeSmall organic molecule
Emp. Form.C74H102N20O15
Mol. Mass.1511.7267
SMILESCC(C)C[C@H](NC(=O)[C@@H](NC(=O)[C@@H](N)Cc1ccc(O)cc1)C(C)C)C(=O)NCC(=O)N1CCC[C@H]1C(=O)N[C@@H](Cc1ccccc1)C(=O)N[C@@H](CCCNC(N)=N)C(=O)N[C@@H](Cc1c[nH]c2ccccc12)C(=O)N[C@@H](CC(O)=O)C(=O)N[C@@H](CCCNC(N)=N)C(=O)N[C@@H](Cc1ccccc1)C(=O)NCC(N)=O