Reaction Details
TargetTyrosine-protein phosphatase non-receptor type 5
LigandBDBM50250603
Substrate/Competitorn/a
Meas. Tech.ChEBML_1681976
Ki 1700±n/a nM
Citation Witten, MRWissler, LSnow, MGeschwindner, SRead, JABrandon, NJNairn, ACLombroso, PJKäck, HEllman, JA X-ray Characterization and Structure-Based Optimization of Striatal-Enriched Protein Tyrosine Phosphatase Inhibitors. J Med Chem60:9299-9319 (2017) 
 
Tyrosine-protein phosphatase non-receptor type 5
Name:Tyrosine-protein phosphatase non-receptor type 5
Type:Enzyme Catalytic Domain
Mol. Mass.:63510.68
Organism:Homo sapiens (Human)
Description:gi_90652859
Residue:565
BDBM50250603
NameBDBM50250603
Synonyms:CHEMBL4102693
TypeSmall organic molecule
Emp. Form.C25H22Cl3FNO5P
Mol. Mass.572.777
SMILESOP(O)(=O)C(C(=O)N1CCOCC1)c1ccc(cc1)-c1cccc(Cc2cc(Cl)c(Cl)cc2Cl)c1F