Reaction Details
TargetBile acid receptor
LigandBDBM50250868
Substrate/Competitorn/a
Meas. Tech.ChEMBL_1682383 (CHEMBL4032660)
EC50 0.270000±n/a nM
Citation Tully, DCRucker, PVChianelli, DWilliams, JVidal, AAlper, PBMutnick, DBursulaya, BSchmeits, JWu, XBao, DZoll, JKim, YGroessl, TMcNamara, PSeidel, HMMolteni, VLiu, BPhimister, AJoseph, SBLaffitte, B Discovery of Tropifexor (LJN452), a Highly Potent Non-bile Acid FXR Agonist for the Treatment of Cholestatic Liver Diseases and Nonalcoholic Steatohepatitis (NASH). J Med Chem60:9960-9973 (2017) 
 
Bile acid receptor
Name:Bile acid receptor
Type:Nuclear Receptor
Mol. Mass.:55916.24
Organism:Homo sapiens (Human)
Description:Q96RI1
Residue:486
BDBM50250868
NameBDBM50250868
Synonyms:CHEMBL4083548
TypeSmall organic molecule
Emp. Form.C29H26F3N3O5S
Mol. Mass.585.594
SMILESOC(=O)c1cc(F)c2nc(sc2c1)N1C2CCC1CC(C2)OCc1c(onc1-c1ccccc1OC(F)F)C1CC1