Reaction Details
TargetKappa-type opioid receptor
LigandBDBM50006997
Substrate/Competitorn/a
Meas. Tech.ChEMBL_145370 (CHEMBL753138)
IC50 368.0±n/a nM
Citation Freeman, JPMichalson, ETD'Andrea, SVBaczynskyj, LVon Voigtlander, PFLahti, RASmith, MWLawson, CFScahill, TAMizsak, SA Naphtho and benzo analogues of the kappa opioid agonist trans-(+/-)-3,4-dichloro-N-methyl-N-[2-(1-pyrrolidinyl)cyclohexyl] benzeneacetamide. J Med Chem34:1891-6 (1991) Kappa-type opioid receptor
Name:Kappa-type opioid receptor
Type:Enzyme
Mol. Mass.:42656.78
Organism:Mus musculus (Mouse)
Description:P33534
Residue:380
BDBM50006997
NameBDBM50006997
Synonyms:3,4-Dichloro-N-methyl-N-(2-pyrrolidin-1-yl-1,2,3,4-tetrahydro-naphthalen-1-yl)-benzamide | CHEMBL55705
TypeSmall organic molecule
Emp. Form.C22H24Cl2N2O
Mol. Mass.403.345
SMILESCN([C@H]1[C@@H](CCc2ccccc12)N1CCCC1)C(=O)c1ccc(Cl)c(Cl)c1