Reaction Details
TargetMu-type opioid receptor
LigandBDBM50007001
Substrate/Competitorn/a
Meas. Tech.ChEMBL_146418 (CHEMBL757170)
Ki>1000±n/a nM
Citation Freeman, JPMichalson, ETD'Andrea, SVBaczynskyj, LVon Voigtlander, PFLahti, RASmith, MWLawson, CFScahill, TAMizsak, SA Naphtho and benzo analogues of the kappa opioid agonist trans-(+/-)-3,4-dichloro-N-methyl-N-[2-(1-pyrrolidinyl)cyclohexyl] benzeneacetamide. J Med Chem34:1891-6 (1991) Mu-type opioid receptor
Name:Mu-type opioid receptor
Type:Enzyme Catalytic Domain
Mol. Mass.:44431.62
Organism:MOUSE
Description:OPIATE Mu OPRM1 MOUSE::P42866
Residue:398
BDBM50007001
NameBDBM50007001
Synonyms:3,4-Dichloro-N-methyl-N-(3-pyrrolidin-1-yl-1,2,3,4-tetrahydro-anthracen-2-yl)-benzamide | CHEMBL294231
TypeSmall organic molecule
Emp. Form.C26H26Cl2N2O
Mol. Mass.453.403
SMILESCN([C@@H]1Cc2cc3ccccc3cc2C[C@H]1N1CCCC1)C(=O)c1ccc(Cl)c(Cl)c1