Reaction Details
TargetMu-type opioid receptor
LigandBDBM50453089
Substrate/Competitorn/a
Meas. Tech.ChEBML_146256
Ki 11±n/a nM
Citation Vecchietti, VClarke, GDColle, RGiardina, GPetrone, GSbacchi, M (1S)-1-(aminomethyl)-2-(arylacetyl)-1,2,3,4-tetrahydroisoquinoline and heterocycle-condensed tetrahydropyridine derivatives: members of a novel class of very potent kappa opioid analgesics. J Med Chem34:2624-33 (1991) Mu-type opioid receptor
Name:Mu-type opioid receptor
Type:Enzyme Catalytic Domain
Mol. Mass.:11165.58
Organism:GUINEA PIG
Description:P97266
Residue:98
BDBM50453089
NameBDBM50453089
Synonyms:CHEMBL2114225
TypeSmall organic molecule
Emp. Form.C23H25F3N2O
Mol. Mass.402.4526
SMILESFC(F)(F)c1ccc(CC(=O)N2CCc3ccccc3[C@H]2CN2CCCC2)cc1