Reaction Details
TargetKappa-type opioid receptor
LigandBDBM50001108
Substrate/Competitorn/a
Meas. Tech.ChEBML_145222
Ki 0.200000±n/a nM
Citation Vecchietti, VClarke, GDColle, RGiardina, GPetrone, GSbacchi, M (1S)-1-(aminomethyl)-2-(arylacetyl)-1,2,3,4-tetrahydroisoquinoline and heterocycle-condensed tetrahydropyridine derivatives: members of a novel class of very potent kappa opioid analgesics. J Med Chem34:2624-33 (1991) Kappa-type opioid receptor
Name:Kappa-type opioid receptor
Type:G Protein-Coupled Receptor (GPCR)
Mol. Mass.:42744.99
Organism:Cavia porcellus (domestic guinea pig)
Description:P41144
Residue:380
BDBM50001108
NameBDBM50001108
Synonyms:2-(3,4-Dichloro-phenyl)-1-(1-pyrrolidin-1-ylmethyl-3,4-dihydro-1H-isoquinolin-2-yl)-ethanone 2-(3,4-Dichloro-phenyl)-1-(1-pyrrolidin-1-ylmethyl-3,4-dihydro-1H-isoquinolin-2-yl)-ethanone;HCl | CHEMBL275025
TypeSmall organic molecule
Emp. Form.C22H24Cl2N2O
Mol. Mass.403.345
SMILESClc1ccc(CC(=O)N2CCc3ccccc3C2CN2CCCC2)cc1Cl