Reaction Details
TargetRho-associated protein kinase 1
LigandBDBM50253706
Substrate/Competitorn/a
Meas. Tech.ChEBML_1685778
IC50 140±n/a nM
Citation Kurasawa, OHomma, MOguro, YMiyazaki, TMori, KUchiyama, NIwai, KOhashi, AHara, HYoshida, SCho, N 2-Aminomethylthieno[3,2-d]pyrimidin-4(3H)-ones bearing 3-methylpyrazole hinge binding moiety: Highly potent, selective, and time-dependent inhibitors of Cdc7 kinase. Bioorg Med Chem25:3658-3670 (2017) 
 
Rho-associated protein kinase 1
Name:Rho-associated protein kinase 1
Type:Serine/threonine-protein kinase
Mol. Mass.:158156.77
Organism:Homo sapiens (Human)
Description:Q13464
Residue:1354
BDBM50253706
NameBDBM50253706
Synonyms:CHEMBL4083927
TypeSmall organic molecule
Emp. Form.C15H17N5OS
Mol. Mass.315.393
SMILESCc1n[nH]cc1-c1cc2nc(CN3CCCC3)[nH]c(=O)c2s1