Reaction Details
TargetCell division cycle 7-related protein kinase
LigandBDBM50253753
Substrate/Competitorn/a
Meas. Tech.ChEBML_1685781
IC50 350±n/a nM
Citation Kurasawa, OHomma, MOguro, YMiyazaki, TMori, KUchiyama, NIwai, KOhashi, AHara, HYoshida, SCho, N 2-Aminomethylthieno[3,2-d]pyrimidin-4(3H)-ones bearing 3-methylpyrazole hinge binding moiety: Highly potent, selective, and time-dependent inhibitors of Cdc7 kinase. Bioorg Med Chem25:3658-3670 (2017) 
 
Cell division cycle 7-related protein kinase
Name:Cell division cycle 7-related protein kinase
Type:Protein
Mol. Mass.:63908.16
Organism:Homo sapiens (Human)
Description:O00311
Residue:574
BDBM50253753
NameBDBM50253753
Synonyms:CHEMBL4062209
TypeSmall organic molecule
Emp. Form.C13H17Cl2N5OS
Mol. Mass.362.278
SMILESCl.Cl.CN(C)Cc1nc2cc(sc2c(=O)[nH]1)-c1c[nH]nc1C