Reaction Details
TargetPotassium voltage-gated channel subfamily H member 2
LigandBDBM50254141
Substrate/Competitorn/a
Meas. Tech.ChEMBL_1686117 (CHEMBL4036596)
IC50 47600±n/a nM
Citation Mitton-Fry, MJBrickner, SJHamel, JCBarham, RBrennan, LCasavant, JMDing, XFinegan, SHardink, JHoang, THuband, MDMaloney, MMarfat, AMcCurdy, SPMcLeod, DSubramanyam, CPlotkin, MReilly, USchafer, JStone, GGUccello, DPWisialowski, TYoon, KZaniewski, RZook, C Novel 3-fluoro-6-methoxyquinoline derivatives as inhibitors of bacterial DNA gyrase and topoisomerase IV. Bioorg Med Chem Lett27:3353-3358 (2017) 
 
Potassium voltage-gated channel subfamily H member 2
Name:Potassium voltage-gated channel subfamily H member 2
Type:Multi-pass membrane protein
Mol. Mass.:126672.65
Organism:Homo sapiens (Human)
Description:Q12809
Residue:1159
BDBM50254141
NameBDBM50254141
Synonyms:CHEMBL2382343
TypeSmall organic molecule
Emp. Form.C29H32F2N2O4
Mol. Mass.510.5722
SMILESCOc1ccc2nccc([C@@H](O)CC[C@@H]3CCN(C[C@@H]3C(O)=O)C3CC(C3)c3c(F)cccc3F)c2c1