Reaction Details
TargetNicotinamide phosphoribosyltransferase
LigandBDBM217170
Substrate/Competitorn/a
Meas. Tech.ChEBML_1686176
Ki 4.9±n/a nM
Citation Curtin, MLHeyman, HRClark, RFSorensen, BKDoherty, GAHansen, TMFrey, RRSarris, KAAguirre, ALShrestha, ATu, NWoller, KPliushchev, MASweis, RFCheng, MWilsbacher, JLKovar, PJGuo, JCheng, DLongenecker, KLRaich, DKorepanova, AVSoni, NBAlgire, MARichardson, PLMarin, VLBadagnani, IVasudevan, ABuchanan, FGMaag, DChiang, GGTse, CMichaelides, MR SAR and characterization of non-substrate isoindoline urea inhibitors of nicotinamide phosphoribosyltransferase (NAMPT). Bioorg Med Chem Lett27:3317-3325 (2017) 
 
Nicotinamide phosphoribosyltransferase
Name:Nicotinamide phosphoribosyltransferase
Type:Enzyme
Mol. Mass.:55524.98
Organism:Homo sapiens (Human)
Description:P43490
Residue:491
BDBM217170
NameBDBM217170
Synonyms:US9302989, 608
TypeSmall organic molecule
Emp. Form.C22H27N3O3
Mol. Mass.381.4681
SMILESCC(C)CCNC(=O)c1ccc(NC(=O)N2Cc3ccc(CO)cc3C2)cc1