Reaction Details
TargetTransient receptor potential cation channel subfamily A member 1
LigandBDBM50254442
Substrate/Competitorn/a
Meas. Tech.ChEBML_1686345
IC50 42±n/a nM
Citation Pryde, DCMarron, BEWest, CWReister, SAmato, GYoger, KAntonio, BPadilla, KCox, PJTurner, JWarmus, JSSwain, NAOmoto, KMahoney, JHGerlach, AC Discovery of a Series of Indazole TRPA1 Antagonists. ACS Med Chem Lett8:666-671 (2017) 
 
Transient receptor potential cation channel subfamily A member 1
Name:Transient receptor potential cation channel subfamily A member 1
Type:Protein
Mol. Mass.:127514.20
Organism:Homo sapiens (Human)
Description:O75762
Residue:1119
BDBM50254442
NameBDBM50254442
Synonyms:CHEMBL4095993
TypeSmall organic molecule
Emp. Form.C14H9ClF3N3
Mol. Mass.311.69
SMILESFC(F)(F)c1ccc2c(Nc3ccc(Cl)cc3)n[nH]c2c1