Reaction Details
TargetC-C chemokine receptor type 2
LigandBDBM50255479
Substrate/Competitorn/a
Meas. Tech.ChEMBL_1687081 (CHEMBL4037560)
EC50>10000±n/a nM
Citation Lu, HYang, TXu, ZLin, XDing, QZhang, YCai, XDong, KGong, SZhang, WPatel, MCopley, RCBXiang, JGuan, XWren, PRen, F Discovery of Novel 1-Cyclopentenyl-3-phenylureas as Selective, Brain Penetrant, and Orally Bioavailable CXCR2 Antagonists. J Med Chem61:2518-2532 (2018) 
 
C-C chemokine receptor type 2
Name:C-C chemokine receptor type 2
Type:Enzyme
Mol. Mass.:41932.32
Organism:Homo sapiens (Human)
Description:P41597
Residue:374
BDBM50255479
NameBDBM50255479
Synonyms:CHEMBL4067429
TypeSmall organic molecule
Emp. Form.C18H23ClN2O5S
Mol. Mass.414.904
SMILESCC1=CCC[C@H]1NC(=O)Nc1ccc(Cl)c(c1O)S(=O)(=O)[C@@]1(C)CCOC1