Reaction Details
TargetMacrophage colony-stimulating factor 1 receptor
LigandBDBM50255880
Substrate/Competitorn/a
Meas. Tech.ChEBML_1687537
IC50 4.7±n/a nM
Citation Xun, QZhang, ZLuo, JTong, LHuang, MWang, ZZou, JLiu, YXu, YXie, HTu, ZCLu, XDing, K Design, Synthesis, and Structure-Activity Relationship Study of 2-Oxo-3,4-dihydropyrimido[4,5- d]pyrimidines as New Colony Stimulating Factor 1 Receptor (CSF1R) Kinase Inhibitors. J Med Chem61:2353-2371 (2018) 
 
Macrophage colony-stimulating factor 1 receptor
Name:Macrophage colony-stimulating factor 1 receptor
Type:Protein
Mol. Mass.:107979.48
Organism:Homo sapiens (Human)
Description:P07333
Residue:972
BDBM50255880
NameBDBM50255880
Synonyms:CHEMBL4076405
TypeSmall organic molecule
Emp. Form.C34H43FN8O3
Mol. Mass.630.7554
SMILESCCC(=O)N1CC[C@@H](C1)N1C(=O)N(Cc2cnc(Nc3ccc(N4CCC(CC4)N(C)C)c(C)c3)nc12)c1cc(OC)ccc1F