Reaction Details
TargetEpidermal growth factor receptor
LigandBDBM50255927
Substrate/Competitorn/a
Meas. Tech.ChEBML_1687538
IC50 373±n/a nM
Citation Xun, QZhang, ZLuo, JTong, LHuang, MWang, ZZou, JLiu, YXu, YXie, HTu, ZCLu, XDing, K Design, Synthesis, and Structure-Activity Relationship Study of 2-Oxo-3,4-dihydropyrimido[4,5- d]pyrimidines as New Colony Stimulating Factor 1 Receptor (CSF1R) Kinase Inhibitors. J Med Chem61:2353-2371 (2018) 
 
Epidermal growth factor receptor
Name:Epidermal growth factor receptor
Type:Receptor Kinase Domain
Mol. Mass.:134279.59
Organism:Homo sapiens (Human)
Description:P00533
Residue:1210
BDBM50255927
NameBDBM50255927
Synonyms:CHEMBL4084726
TypeSmall organic molecule
Emp. Form.C32H39ClN8O3
Mol. Mass.619.157
SMILESCCC(=O)N1CC[C@@H](C1)N1C(=O)N(Cc2cnc(Nc3ccc(N4CCN(C)CC4)c(C)c3)nc12)c1cc(OC)ccc1Cl