Reaction Details
TargetEpidermal growth factor receptor
LigandBDBM50255879
Substrate/Competitorn/a
Meas. Tech.ChEBML_1687538
IC50 0.500000±n/a nM
Citation Xun, QZhang, ZLuo, JTong, LHuang, MWang, ZZou, JLiu, YXu, YXie, HTu, ZCLu, XDing, K Design, Synthesis, and Structure-Activity Relationship Study of 2-Oxo-3,4-dihydropyrimido[4,5- d]pyrimidines as New Colony Stimulating Factor 1 Receptor (CSF1R) Kinase Inhibitors. J Med Chem61:2353-2371 (2018) 
 
Epidermal growth factor receptor
Name:Epidermal growth factor receptor
Type:Receptor Kinase Domain
Mol. Mass.:134279.59
Organism:Homo sapiens (Human)
Description:P00533
Residue:1210
BDBM50255879
NameBDBM50255879
Synonyms:CHEMBL4071474
TypeSmall organic molecule
Emp. Form.C31H35ClN8O2
Mol. Mass.587.115
SMILESCN1CCN(CC1)c1ccc(Nc2ncc3CN(C(=O)N([C@H]4CCN(C4)C(=O)C=C)c3n2)c2ccccc2Cl)cc1C