Reaction Details
TargetBromodomain and WD repeat-containing protein 1
LigandBDBM50158624
Substrate/Competitorn/a
Meas. Tech.ChEBML_1687849
IC50>10000±n/a nM
Citation Hasvold, LASheppard, GSWang, LFidanze, SDLiu, DPratt, JKMantei, RAWada, CKHubbard, RShen, YLin, XHuang, XWarder, SEWilcox, DLi, LBuchanan, FGSmithee, LAlbert, DHMagoc, TJPark, CHPetros, AMPanchal, SCSun, CKovar, PSoni, NBElmore, SWKati, WMMcDaniel, KF Methylpyrrole inhibitors of BET bromodomains. Bioorg Med Chem Lett27:2225-2233 (2017) 
 
Bromodomain and WD repeat-containing protein 1
Name:Bromodomain and WD repeat-containing protein 1
Type:PROTEIN
Mol. Mass.:262994.15
Organism:Homo sapiens (Human)
Description:ChEMBL_109516
Residue:2320
BDBM50158624
NameBDBM50158624
Synonyms:CHEMBL3786012
TypeSmall organic molecule
Emp. Form.C21H18F2N2O4S
Mol. Mass.432.44
SMILESCc1[nH]c(c2CCNC(=O)c12)-c1cc(ccc1Oc1ccc(F)cc1F)S(C)(=O)=O