Reaction Details
TargetBromodomain-containing protein 4
LigandBDBM50256361
Substrate/Competitorn/a
Meas. Tech.ChEMBL_1687822 (CHEMBL4038392)
Ki 77±n/a nM
Citation Hasvold, LASheppard, GSWang, LFidanze, SDLiu, DPratt, JKMantei, RAWada, CKHubbard, RShen, YLin, XHuang, XWarder, SEWilcox, DLi, LBuchanan, FGSmithee, LAlbert, DHMagoc, TJPark, CHPetros, AMPanchal, SCSun, CKovar, PSoni, NBElmore, SWKati, WMMcDaniel, KF Methylpyrrole inhibitors of BET bromodomains. Bioorg Med Chem Lett27:2225-2233 (2017) 
 
Bromodomain-containing protein 4
Name:Bromodomain-containing protein 4
Type:Protein
Mol. Mass.:152264.84
Organism:Homo sapiens (Human)
Description:O60885
Residue:1362
BDBM50256361
NameBDBM50256361
Synonyms:CHEMBL4095264
TypeSmall organic molecule
Emp. Form.C20H15F2N3O4S
Mol. Mass.431.413
SMILESCc1[nH]c(-c2cc(ccc2Oc2ccc(F)cc2F)S(C)(=O)=O)c2cn[nH]c(=O)c12