Reaction Details
TargetBromodomain-containing protein 4
LigandBDBM50256371
Substrate/Competitorn/a
Meas. Tech.ChEBML_1687822
EC50 420±n/a nM
Citation Hasvold, LASheppard, GSWang, LFidanze, SDLiu, DPratt, JKMantei, RAWada, CKHubbard, RShen, YLin, XHuang, XWarder, SEWilcox, DLi, LBuchanan, FGSmithee, LAlbert, DHMagoc, TJPark, CHPetros, AMPanchal, SCSun, CKovar, PSoni, NBElmore, SWKati, WMMcDaniel, KF Methylpyrrole inhibitors of BET bromodomains. Bioorg Med Chem Lett27:2225-2233 (2017) 
 
Bromodomain-containing protein 4
Name:Bromodomain-containing protein 4
Type:Protein
Mol. Mass.:152264.84
Organism:Homo sapiens (Human)
Description:O60885
Residue:1362
BDBM50256371
NameBDBM50256371
Synonyms:CHEMBL4067320
TypeSmall organic molecule
Emp. Form.C21H19F2N3O4S
Mol. Mass.447.455
SMILESCc1[nH]c(c2CCNC(=O)c12)-c1cc(NS(C)(=O)=O)ccc1Oc1ccc(F)cc1F