Reaction Details
TargetBromodomain-containing protein 4
LigandBDBM50256406
Substrate/Competitorn/a
Meas. Tech.ChEMBL_1687824 (CHEMBL4038394)
EC50 46±n/a nM
Citation Hasvold, LASheppard, GSWang, LFidanze, SDLiu, DPratt, JKMantei, RAWada, CKHubbard, RShen, YLin, XHuang, XWarder, SEWilcox, DLi, LBuchanan, FGSmithee, LAlbert, DHMagoc, TJPark, CHPetros, AMPanchal, SCSun, CKovar, PSoni, NBElmore, SWKati, WMMcDaniel, KF Methylpyrrole inhibitors of BET bromodomains. Bioorg Med Chem Lett27:2225-2233 (2017) 
 
Bromodomain-containing protein 4
Name:Bromodomain-containing protein 4
Type:Protein
Mol. Mass.:152264.84
Organism:Homo sapiens (Human)
Description:O60885
Residue:1362
BDBM50256406
NameBDBM50256406
Synonyms:CHEMBL4079684
TypeSmall organic molecule
Emp. Form.C21H17F2N3O4S
Mol. Mass.445.439
SMILESCn1cc(-c2cc(NS(C)(=O)=O)ccc2Oc2ccc(F)cc2F)c2cc[nH]c(=O)c12