Reaction Details
TargetBromodomain and WD repeat-containing protein 1
LigandBDBM50256397
Substrate/Competitorn/a
Meas. Tech.ChEBML_1687849
IC50>10000±n/a nM
Citation Hasvold, LASheppard, GSWang, LFidanze, SDLiu, DPratt, JKMantei, RAWada, CKHubbard, RShen, YLin, XHuang, XWarder, SEWilcox, DLi, LBuchanan, FGSmithee, LAlbert, DHMagoc, TJPark, CHPetros, AMPanchal, SCSun, CKovar, PSoni, NBElmore, SWKati, WMMcDaniel, KF Methylpyrrole inhibitors of BET bromodomains. Bioorg Med Chem Lett27:2225-2233 (2017) 
 
Bromodomain and WD repeat-containing protein 1
Name:Bromodomain and WD repeat-containing protein 1
Type:PROTEIN
Mol. Mass.:262994.15
Organism:Homo sapiens (Human)
Description:ChEMBL_109516
Residue:2320
BDBM50256397
NameBDBM50256397
Synonyms:CHEMBL4088466
TypeSmall organic molecule
Emp. Form.C21H16F2N2O4S
Mol. Mass.430.425
SMILESCn1cc(-c2cc(ccc2Oc2ccc(F)cc2F)S(C)(=O)=O)c2cc[nH]c(=O)c12