Reaction Details
TargetBromodomain and WD repeat-containing protein 1
LigandBDBM342597
Substrate/Competitorn/a
Meas. Tech.ChEBML_1687849
IC50 10000±n/a nM
Citation Hasvold, LASheppard, GSWang, LFidanze, SDLiu, DPratt, JKMantei, RAWada, CKHubbard, RShen, YLin, XHuang, XWarder, SEWilcox, DLi, LBuchanan, FGSmithee, LAlbert, DHMagoc, TJPark, CHPetros, AMPanchal, SCSun, CKovar, PSoni, NBElmore, SWKati, WMMcDaniel, KF Methylpyrrole inhibitors of BET bromodomains. Bioorg Med Chem Lett27:2225-2233 (2017) 
 
Bromodomain and WD repeat-containing protein 1
Name:Bromodomain and WD repeat-containing protein 1
Type:PROTEIN
Mol. Mass.:262994.15
Organism:Homo sapiens (Human)
Description:ChEMBL_109516
Residue:2320
BDBM342597
NameBDBM342597
Synonyms:N-[3-(3-methyl-4-oxo-4,5,6,7-tetrahydro-2H-isoindol-1-yl)-4-phenoxyphenyl]methanesulfonamide | US9776990, Example 40
TypeSmall organic molecule
Emp. Form.C22H22N2O4S
Mol. Mass.410.486
SMILESCc1[nH]c(c2CCCC(=O)c12)-c1cc(NS(C)(=O)=O)ccc1Oc1ccccc1