Reaction Details
TargetBromodomain-containing protein 4
LigandBDBM50256707
Substrate/Competitorn/a
Meas. Tech.ChEMBL_1688165 (CHEMBL4038735)
IC50 280±n/a nM
Citation Zhao, LYang, YGuo, YYang, LZhang, JZhou, JZhang, H Design, synthesis and biological evaluation of 7-methylimidazo[1,5-a]pyrazin-8(7H)-one derivatives as BRD4 inhibitors. Bioorg Med Chem25:2482-2490 (2017) 
 
Bromodomain-containing protein 4
Name:Bromodomain-containing protein 4
Type:Protein
Mol. Mass.:152264.84
Organism:Homo sapiens (Human)
Description:O60885
Residue:1362
BDBM50256707
NameBDBM50256707
Synonyms:CHEMBL4093710
TypeSmall organic molecule
Emp. Form.C25H22N4O6S3
Mol. Mass.570.66
SMILESCCS(=O)(=O)c1ccc(Oc2cccc(NS(=O)(=O)c3cccs3)c2)c(c1)-c1cn(C)c(=O)c2cncn12