Reaction Details
TargetBile acid receptor
LigandBDBM50258109
Substrate/Competitorn/a
Meas. Tech.ChEBML_1690208
EC50 0.300000±n/a nM
Citation Flesch, DCheung, SYSchmidt, JGabler, MHeitel, PKramer, JKaiser, AHartmann, MLindner, MLüddens-Dämgen, KHeering, JLamers, CLüddens, HWurglics, MProschak, ESchubert-Zsilavecz, MMerk, D Nonacidic Farnesoid X Receptor Modulators. J Med Chem60:7199-7205 (2017) 
 
Bile acid receptor
Name:Bile acid receptor
Type:Nuclear Receptor
Mol. Mass.:55916.24
Organism:Homo sapiens (Human)
Description:Q96RI1
Residue:486
BDBM50258109
NameBDBM50258109
Synonyms:CHEMBL4077016
TypeSmall organic molecule
Emp. Form.C20H16Cl2N4O
Mol. Mass.399.273
SMILESCOc1ccc(CNc2c(nc3ccc(Cl)cn23)-c2cc(Cl)ccn2)cc1