Reaction Details
TargetCysteine protease
LigandBDBM50258542
Substrate/Competitorn/a
Meas. Tech.ChEBML_1690561
Ki 2.0±n/a nM
Citation Previti, SEttari, RCosconati, SAmendola, GChouchene, KWagner, AHellmich, UAUlrich, KKrauth-Siegel, RLWich, PRSchmid, ISchirmeister, TGut, JRosenthal, PJGrasso, SZappalą, M Development of Novel Peptide-Based Michael Acceptors Targeting Rhodesain and Falcipain-2 for the Treatment of Neglected Tropical Diseases (NTDs). J Med Chem60:6911-6923 (2017) 
 
Cysteine protease
Name:Cysteine protease
Synonyms:Rhodesain
Type:PROTEIN
Mol. Mass.:48425.78
Organism:Trypanosoma brucei rhodesiense
Description:ChEMBL_619861
Residue:450
BDBM50258542
NameBDBM50258542
Synonyms:CHEMBL4082758
TypeSmall organic molecule
Emp. Form.C30H32N2O5
Mol. Mass.500.5855
SMILESCOC(=O)\C=C\[C@H](CCc1ccccc1)NC(=O)[C@H](Cc1ccccc1)NC(=O)OCc1ccccc1