Reaction Details
TargetSerine/threonine-protein kinase WNK1
LigandBDBM50258581
Substrate/Competitorn/a
Meas. Tech.ChEMBL_1690564 (CHEMBL4041134)
EC50 1390±n/a nM
Citation Yamada, KLevell, JYoon, TKohls, DYowe, DRigel, DFImase, HYuan, JYasoshima, KDiPetrillo, KMonovich, LXu, LZhu, MKato, MJain, MIdamakanti, NTaslimi, PKawanami, TArgikar, UAKunjathoor, VXie, XYagi, YIIwaki, YRobinson, ZPark, HM Optimization of Allosteric With-No-Lysine (WNK) Kinase Inhibitors and Efficacy in Rodent Hypertension Models. J Med Chem60:7099-7107 (2017) 
 
Serine/threonine-protein kinase WNK1
Name:Serine/threonine-protein kinase WNK1
Type:PROTEIN
Mol. Mass.:250784.18
Organism:Homo sapiens (Human)
Description:ChEMBL_876549
Residue:2382
BDBM50258581
NameBDBM50258581
Synonyms:CHEMBL4070177
TypeSmall organic molecule
Emp. Form.C26H29N3O
Mol. Mass.399.528
SMILESCOc1cccc(c1)-c1cc(c(C)cn1)-n1cc(CNCC(C)C)c2ccccc12