Reaction Details
TargetSerine/threonine-protein kinase WNK1
LigandBDBM50258568
Substrate/Competitorn/a
Meas. Tech.ChEBML_1690564
IC50 750±n/a nM
Citation Yamada, KLevell, JYoon, TKohls, DYowe, DRigel, DFImase, HYuan, JYasoshima, KDiPetrillo, KMonovich, LXu, LZhu, MKato, MJain, MIdamakanti, NTaslimi, PKawanami, TArgikar, UAKunjathoor, VXie, XYagi, YIIwaki, YRobinson, ZPark, HM Optimization of Allosteric With-No-Lysine (WNK) Kinase Inhibitors and Efficacy in Rodent Hypertension Models. J Med Chem60:7099-7107 (2017) 
 
Serine/threonine-protein kinase WNK1
Name:Serine/threonine-protein kinase WNK1
Type:PROTEIN
Mol. Mass.:250784.18
Organism:Homo sapiens (Human)
Description:ChEMBL_876549
Residue:2382
BDBM50258568
NameBDBM50258568
Synonyms:CHEMBL4083340
TypeSmall organic molecule
Emp. Form.C29H28ClN3O2
Mol. Mass.486.005
SMILESCOc1cccc(c1)-c1cc(C(=O)N(C)[C@@H]2CCN(Cc3ccc(Cl)cc3)C2)c2ccccc2n1