Reaction Details
TargetSerine/threonine-protein kinase WNK1
LigandBDBM50258598
Substrate/Competitorn/a
Meas. Tech.ChEBML_1690564
IC50 39±n/a nM
Citation Yamada, KLevell, JYoon, TKohls, DYowe, DRigel, DFImase, HYuan, JYasoshima, KDiPetrillo, KMonovich, LXu, LZhu, MKato, MJain, MIdamakanti, NTaslimi, PKawanami, TArgikar, UAKunjathoor, VXie, XYagi, YIIwaki, YRobinson, ZPark, HM Optimization of Allosteric With-No-Lysine (WNK) Kinase Inhibitors and Efficacy in Rodent Hypertension Models. J Med Chem60:7099-7107 (2017) 
 
Serine/threonine-protein kinase WNK1
Name:Serine/threonine-protein kinase WNK1
Type:PROTEIN
Mol. Mass.:250784.18
Organism:Homo sapiens (Human)
Description:ChEMBL_876549
Residue:2382
BDBM50258598
NameBDBM50258598
Synonyms:CHEMBL4091128
TypeSmall organic molecule
Emp. Form.C28H30FN3O
Mol. Mass.443.5557
SMILESCOc1cccc(c1)-c1cc(ccn1)-n1cc(CNCC2CCCCC2)c2ccc(F)cc12